Mail Archives: pgcc/1999/10/27/18:54:10
<!doctype html public "-//w3c//dtd html 4.0 transitional//en">
<html>
Hello all,
<p>I got same compiler errors with pgcc-2.95.1 on VTK (Visualization Toolkit).
<p>SunWave1>time make
<br>cd wrap; make - all
<br>make[1]: Entering directory `/usr/local/vtk/vtk/wrap'
<br>make[1]: Nothing to be done for `all'.
<br>make[1]: Leaving directory `/usr/local/vtk/vtk/wrap'
<br>cd common; make - targets.make
<br>make[1]: Entering directory `/usr/local/vtk/vtk/common'
<br>make[1]: `targets.make' is up to date.
<br>make[1]: Leaving directory `/usr/local/vtk/vtk/common'
<br>cd common; make - all
<br>make[1]: Entering directory `/usr/local/vtk/vtk/common'
<br>make[1]: Nothing to be done for `all'.
<br>make[1]: Leaving directory `/usr/local/vtk/vtk/common'
<br>cd graphics; make - targets.make
<br>make[1]: Entering directory `/usr/local/vtk/vtk/graphics'
<br>make[1]: `targets.make' is up to date.
<br>make[1]: Leaving directory `/usr/local/vtk/vtk/graphics'
<br>cd graphics; make - all
<br>make[1]: Entering directory `/usr/local/vtk/vtk/graphics'
<br>c++ -O6 -mpentiumpro -march=pentiumpro -malign-double -mstack-align-double
-pipe -fomit-frame-pointer -funroll-loops -fPIC -DVTK_USE_PTHREADS -D_HP_NO_FAST_MACROS
-DHAVE_LIMITS_H -DHAVE_UNISTD_H -I. -I. -I./../graphics -DVTK_USE_GRAPHICS
-I./../imaging -DVTK_USE_IMAGING
<br>-I./../patented -DVTK_USE_PATENTED -I./../contrib -DVTK_USE_CONTRIB
-DVTK_USE_OGLR -I/usr/X11R6/include -I./../common
-c vtkThreshold.cxx -o vtkThreshold.o
<br>vtkThreshold.cxx: In method `void vtkThreshold::PrintSelf(ostream &,
vtkIndent)':
<br>vtkThreshold.cxx:290: Internal compiler error in `find_free_reg', at
local-alloc.c:1968
<br>Please submit a full bug report.
<br>See <URL:<A HREF="http://www.gnu.org/software/gcc/faq.html#bugreport">http://www.gnu.org/software/gcc/faq.html#bugreport</A>> for
instructions.
<br>make[1]: *** [vtkThreshold.o] Error 1
<br>make[1]: Leaving directory `/usr/local/vtk/vtk/graphics'
<br>make: *** [build_graphics] Error 2
<br>3.840u 0.210s 0:04.50 90.0% 0+0k 0+0io 2726pf+0w
<p>Changed too:
<p>c++ -O -mpentiumpro -march=pentiumpro -malign-double -mstack-align-double
-pipe -fomit-frame-pointer -funroll-loops -fPIC -DVTK_USE_PTHREADS -D_HP_NO_FAST_MACROS
-DHAVE_LIMITS_H -DHAVE_UNISTD_H -I. -I. -I./../graphics -DVTK_USE_GRAPHICS
-I./../imaging -DVTK_USE_IMAGING -I./../patented -DVTK_USE_PATENTED -I./../contrib
-DVTK_USE_CONTRIB -DVTK_USE_OGLR -I/usr/X11R6/include
-I./../common -c vtkThreshold.cxx -o vtkThreshold.o
<p>****************************************************
<p>c++ -O6 -mpentiumpro -march=pentiumpro -malign-double -mstack-align-double
-pipe -fomit-frame-pointer -funroll-loops -fPIC -DVTK_USE_PTHREADS -D_HP_NO_FAST_MACROS
-DHAVE_LIMITS_H -DHAVE_UNISTD_H -I. -I. -I./../graphics -DVTK_USE_GRAPHICS
-I./../imaging -DVTK_USE_IMAGING
<br>-I./../patented -DVTK_USE_PATENTED -I./../contrib -DVTK_USE_CONTRIB
-DVTK_USE_OGLR -I/usr/X11R6/include -I./../common
-c vtkThresholdTextureCoords.cxx -o vtkThresholdTextureCoords.o
<br>vtkThresholdTextureCoords.cxx: In method `void vtkThresholdTextureCoords::PrintSelf(ostream
&, vtkIndent)':
<br>vtkThresholdTextureCoords.cxx:188: Internal compiler error in `find_free_reg',
at local-alloc.c:1968
<br>Please submit a full bug report.
<br>See <URL:<A HREF="http://www.gnu.org/software/gcc/faq.html#bugreport">http://www.gnu.org/software/gcc/faq.html#bugreport</A>> for
instructions.
<br>make[1]: *** [vtkThresholdTextureCoords.o] Error 1
<br>make[1]: Leaving directory `/usr/local/vtk/vtk/graphics'
<br>make: *** [build_graphics] Error 2
<br>5.190u 0.280s 0:05.51 99.2% 0+0k 0+0io 3729pf+0w
<p>Changed too:
<p>c++ -O -mpentiumpro -march=pentiumpro -malign-double -mstack-align-double
-pipe -fomit-frame-pointer -funroll-loops -fPIC -DVTK_USE_PTHREADS -D_HP_NO_FAST_MACROS
-DHAVE_LIMITS_H -DHAVE_UNISTD_H -I. -I. -I./../graphics -DVTK_USE_GRAPHICS
-I./../imaging -DVTK_USE_IMAGING -I./../patented -DVTK_USE_PATENTED -I./../contrib
-DVTK_USE_CONTRIB -DVTK_USE_OGLR -I/usr/X11R6/include
-I./../common -c vtkThresholdTextureCoords.cxx
-o vtkThresholdTextureCoords.o
<p>****************************************************
<p>c++ -O6 -mpentiumpro -march=pentiumpro -malign-double -mstack-align-double
-pipe -fomit-frame-pointer -funroll-loops -fPIC -DVTK_USE_PTHREADS -D_HP_NO_FAST_MACROS
-DHAVE_LIMITS_H -DHAVE_UNISTD_H -I. -I. -I./../graphics -DVTK_USE_GRAPHICS
-I./../imaging -DVTK_USE_IMAGING
<br>-I./../patented -DVTK_USE_PATENTED -I./../contrib -DVTK_USE_CONTRIB
-DVTK_USE_OGLR -I/usr/X11R6/include -I./../common
-c vtkImageCityBlockDistance.cxx -o vtkImageCityBlockDistance.o
<br>vtkImageCityBlockDistance.cxx: In method `void vtkImageCityBlockDistance::Execute(vtkImageData
*, vtkImageData *)':
<br>vtkImageCityBlockDistance.cxx:255: Internal compiler error in `calculate_needs',
at reload1.c:1695
<br>Please submit a full bug report.
<br>See <URL:<A HREF="http://www.gnu.org/software/gcc/faq.html#bugreport">http://www.gnu.org/software/gcc/faq.html#bugreport</A>> for
instructions.
<br>make[1]: *** [vtkImageCityBlockDistance.o] Error 1
<br>make[1]: Leaving directory `/usr/local/vtk/vtk/imaging'
<br>make: *** [build_imaging] Error 2
<br>852.080u 32.920s 14:54.66 98.9% 0+0k 0+0io 408284pf+0w
<p>Changed too:
<p>c++ -O -mpentiumpro -march=pentiumpro -malign-double -mstack-align-double
-pipe -fomit-frame-pointer -funroll-loops -fPIC -DVTK_USE_PTHREADS -D_HP_NO_FAST_MACROS
-DHAVE_LIMITS_H -DHAVE_UNISTD_H -I. -I. -I./../graphics -DVTK_USE_GRAPHICS
-I./../imaging -DVTK_USE_IMAGING -I./../patented -DVTK_USE_PATENTED -I./../contrib
-DVTK_USE_CONTRIB -DVTK_USE_OGLR -I/usr/X11R6/include -I./../common
-c vtkImageCityBlockDistance.cxx -o vtkImageCityBlockDistance.o
<p>-Dieter
<pre>--
Dieter Nützel
Graduate Student, Computer Science
University of Hamburg
Department of Computer Science
Cognitive Systems Group
Vogt-Kölln-Straße 30
D-22527 Hamburg, Germany
email: nuetzel AT kogs DOT informatik DOT uni-hamburg DOT de
@home: dieter DOT nuetzel AT myokay DOT net</pre>
</html>
- Raw text -